Aller au contenu


Photo

Kit Robot Quadrupède [testé par Jekert]


  • Veuillez vous connecter pour répondre
115 réponses à ce sujet

#101 Nulentout

Nulentout

    Nouveau membre

  • Membres
  • 70 messages
  • Gender:Male

Posté 30 juillet 2018 - 05:58

Harf arf arf, je ne peux pas le savoir, car ici mon système d'exploitation le plus "moderne" est VISTA !

Normalement, tout au moins sous Vista, quand je clique sur un fichier.ino l'éditeur s'ouvre immédiatement. J'ai certainement indiqué le programme par défaut pour ce type de fichier.

Amicalement : Nulentout.



#102 Jordan

Jordan

    Nouveau membre

  • Membres
  • 17 messages

Posté 31 juillet 2018 - 01:19

Merci pour ta réponse.

 

j'ai chargé le fichier code de cette manière et quand je demande de verifier le code, l'editeur me donne encore la réponse "erreur de compilation "... 

 

avez vous une piste pour moi ?

 

merci d'avance 

 

Jordan  



#103 Nulentout

Nulentout

    Nouveau membre

  • Membres
  • 70 messages
  • Gender:Male

Posté 31 juillet 2018 - 02:31

Ben ... impossible de comprendre si tu ne nous précises pas quel est le type d'erreur. En orange le compilateur explique à sa façon le problème rencontré.

Amicalement : Nulentout.



#104 Jordan

Jordan

    Nouveau membre

  • Membres
  • 17 messages

Posté 01 août 2018 - 07:11

je suis désolé mais je n'arrive pas mettre une pièce jointe ou photo dans le chat...



#105 Mike118

Mike118

    Staff Robot Maker

  • Administrateur
  • PipPipPipPipPip
  • 7 105 messages
  • Gender:Male
  • Location:Cholet
  • Interests:Robotique, Entrepreneuriat, Innovation, Programmation, Résolution de problème, Recherche de solutions, Mécanique, Electronique, Créer, Concevoir

Posté 01 août 2018 - 08:08

est ce que ce lien : Comment publier du contenu sur robot maker  peut résoudre tes problèmes pour insérer une pièce jointe ? 


Si mon commentaire vous a plus laissez nous un avis  !  :thank_you:

Nouveau sur Robot Maker ? 

Jetez un oeil aux blogs, aux tutoriels, aux ouvrages, au robotscope  aux articles,  à la boutique  et aux différents services disponible !

 

Les réalisations de Mike118  

 

 

 


#106 Nulentout

Nulentout

    Nouveau membre

  • Membres
  • 70 messages
  • Gender:Male

Posté 01 août 2018 - 02:35

Ben ... recopie et colle le texte de l'erreur.

Par exemple j'ai effectué un Copier du texte d'erreur orange en provoquant volontairement une erreur de compilation.

Puis un coller et ça donne ça :

Buzzer_passif.ino: In function 'void loop()':
Buzzer_passif.ino:29:29: error: 'Duree' was not declared in this scope
Erreur lors de la compilation.

 

Ainsi on peut chercher à déterminer le problème.

 

Amicalement : Nulentout.



#107 Jordan

Jordan

    Nouveau membre

  • Membres
  • 17 messages

Posté 02 août 2018 - 09:11

j'ai trouvé merci ;-)

 



#108 Jordan

Jordan

    Nouveau membre

  • Membres
  • 17 messages

Posté 02 août 2018 - 09:12

voici le snapshot...

Image(s) jointe(s)

  • thumbnail.png


#109 arobasseb

arobasseb

    Membre chevronné

  • Modérateur
  • PipPipPipPip
  • 679 messages
  • Gender:Male
  • Location:BORDEAUX (33)
  • Interests:Informatique, robotique et sciences technique en générale.

Posté 02 août 2018 - 09:22

Malheureusement sur la capture je ne pense pas qu'on tout le message d'erreur (d'ailleurs le bouton "Recopier les messages d'erreur " doit te mettre tout le contenu du message dans le presse-papier pour pouvoir le coller). Ensuite ta carte arduino est bien une nano ? et le microcontrôleur dessus est bien un ATmega328P ?



#110 Nulentout

Nulentout

    Nouveau membre

  • Membres
  • 70 messages
  • Gender:Male

Posté 02 août 2018 - 09:34

Ben oui, pour analyser l'erreur de compilation il nous faut l'intégralité du texte orange.

Amicalement : Nulentout.



#111 Melmet

Melmet

    Pilier du forum

  • Modérateur
  • PipPipPipPipPip
  • 1 064 messages
  • Gender:Male
  • Location:Saint-Sozy (46200)

Posté 02 août 2018 - 01:05

tu es sur que ta carte c'est bien une Nano? 



#112 Jordan

Jordan

    Nouveau membre

  • Membres
  • 17 messages

Posté 03 août 2018 - 07:31

voici le message d'erreur

 

Arduino : 1.8.5 (Windows 10), Carte : "Arduino Nano, ATmega328P"
 
C:\Program Files\Arduino\arduino-builder -dump-prefs -logger=machine -hardware C:\Program Files\Arduino\hardware -tools C:\Program Files\Arduino\tools-builder -tools C:\Program Files\Arduino\hardware\tools\avr -built-in-libraries C:\Program Files\Arduino\libraries -libraries D:\Mes documents\Arduino\libraries -fqbn=arduino:avr:nano:cpu=atmega328 -ide-version=10805 -build-path C:\Users\Jordan\AppData\Local\Temp\arduino_build_842574 -warnings=all -build-cache C:\Users\Jordan\AppData\Local\Temp\arduino_cache_92881 -prefs=build.warn_data_percentage=75 -prefs=runtime.tools.arduinoOTA.path=C:\Program Files\Arduino\hardware\tools\avr -prefs=runtime.tools.avr-gcc.path=C:\Program Files\Arduino\hardware\tools\avr -prefs=runtime.tools.avrdude.path=C:\Program Files\Arduino\hardware\tools\avr -verbose D:\Mes documents\Arduino\sketch_jul29a\sketch_jul29a.ino
C:\Program Files\Arduino\arduino-builder -compile -logger=machine -hardware C:\Program Files\Arduino\hardware -tools C:\Program Files\Arduino\tools-builder -tools C:\Program Files\Arduino\hardware\tools\avr -built-in-libraries C:\Program Files\Arduino\libraries -libraries D:\Mes documents\Arduino\libraries -fqbn=arduino:avr:nano:cpu=atmega328 -ide-version=10805 -build-path C:\Users\Jordan\AppData\Local\Temp\arduino_build_842574 -warnings=all -build-cache C:\Users\Jordan\AppData\Local\Temp\arduino_cache_92881 -prefs=build.warn_data_percentage=75 -prefs=runtime.tools.arduinoOTA.path=C:\Program Files\Arduino\hardware\tools\avr -prefs=runtime.tools.avr-gcc.path=C:\Program Files\Arduino\hardware\tools\avr -prefs=runtime.tools.avrdude.path=C:\Program Files\Arduino\hardware\tools\avr -verbose D:\Mes documents\Arduino\sketch_jul29a\sketch_jul29a.ino
Using board 'nano' from platform in folder: C:\Program Files\Arduino\hardware\arduino\avr
Using core 'arduino' from platform in folder: C:\Program Files\Arduino\hardware\arduino\avr
Detecting libraries used...
"C:\Program Files\Arduino\hardware\tools\avr/bin/avr-g++" -c -g -Os -w -std=gnu++11 -fpermissive -fno-exceptions -ffunction-sections -fdata-sections -fno-threadsafe-statics  -flto -w -x c++ -E -CC -mmcu=atmega328p -DF_CPU=16000000L -DARDUINO=10805 -DARDUINO_AVR_NANO -DARDUINO_ARCH_AVR   "-IC:\Program Files\Arduino\hardware\arduino\avr\cores\arduino" "-IC:\Program Files\Arduino\hardware\arduino\avr\variants\eightanaloginputs" "C:\Users\Jordan\AppData\Local\Temp\arduino_build_842574\sketch\sketch_jul29a.ino.cpp" -o "nul"
"C:\Program Files\Arduino\hardware\tools\avr/bin/avr-g++" -c -g -Os -w -std=gnu++11 -fpermissive -fno-exceptions -ffunction-sections -fdata-sections -fno-threadsafe-statics  -flto -w -x c++ -E -CC -mmcu=atmega328p -DF_CPU=16000000L -DARDUINO=10805 -DARDUINO_AVR_NANO -DARDUINO_ARCH_AVR   "-IC:\Program Files\Arduino\hardware\arduino\avr\cores\arduino" "-IC:\Program Files\Arduino\hardware\arduino\avr\variants\eightanaloginputs" "-IC:\Program Files\Arduino\hardware\arduino\avr\libraries\Wire\src" "C:\Users\Jordan\AppData\Local\Temp\arduino_build_842574\sketch\sketch_jul29a.ino.cpp" -o "nul"
"C:\Program Files\Arduino\hardware\tools\avr/bin/avr-g++" -c -g -Os -w -std=gnu++11 -fpermissive -fno-exceptions -ffunction-sections -fdata-sections -fno-threadsafe-statics  -flto -w -x c++ -E -CC -mmcu=atmega328p -DF_CPU=16000000L -DARDUINO=10805 -DARDUINO_AVR_NANO -DARDUINO_ARCH_AVR   "-IC:\Program Files\Arduino\hardware\arduino\avr\cores\arduino" "-IC:\Program Files\Arduino\hardware\arduino\avr\variants\eightanaloginputs" "-IC:\Program Files\Arduino\hardware\arduino\avr\libraries\Wire\src" "C:\Users\Jordan\AppData\Local\Temp\arduino_build_842574\sketch\sketch_jul29a.ino.cpp" -o "C:\Users\Jordan\AppData\Local\Temp\arduino_build_842574\preproc\ctags_target_for_gcc_minus_e.cpp"
D:\Mes documents\Arduino\sketch_jul29a\sketch_jul29a.ino:3:37: fatal error: Adafruit_PWMServoDriver.h: No such file or directory
 
 #include <Adafruit_PWMServoDriver.h>
 
                                     ^
 
compilation terminated.
 
Utilisation de la bibliothèque Wire version 1.0 dans le dossier: C:\Program Files\Arduino\hardware\arduino\avr\libraries\Wire 
exit status 1
Erreur de compilation pour la carte Arduino Nano


#113 Mike118

Mike118

    Staff Robot Maker

  • Administrateur
  • PipPipPipPipPip
  • 7 105 messages
  • Gender:Male
  • Location:Cholet
  • Interests:Robotique, Entrepreneuriat, Innovation, Programmation, Résolution de problème, Recherche de solutions, Mécanique, Electronique, Créer, Concevoir

Posté 03 août 2018 - 07:54

As tu installé la librairie Adafruit PWM Servo driver

Une fois la librairie au format .zip téléchargé il faut installer la librairie .


Si mon commentaire vous a plus laissez nous un avis  !  :thank_you:

Nouveau sur Robot Maker ? 

Jetez un oeil aux blogs, aux tutoriels, aux ouvrages, au robotscope  aux articles,  à la boutique  et aux différents services disponible !

 

Les réalisations de Mike118  

 

 

 


#114 Jordan

Jordan

    Nouveau membre

  • Membres
  • 17 messages

Posté 08 août 2018 - 07:27

super merci j'ai installé la librairie et le code avance déja mieux mais il se bloque encore 

 

Arduino : 1.8.5 (Windows 10), Carte : "Arduino Nano, ATmega328P"
 
C:\Program Files\Arduino\arduino-builder -dump-prefs -logger=machine -hardware C:\Program Files\Arduino\hardware -tools C:\Program Files\Arduino\tools-builder -tools C:\Program Files\Arduino\hardware\tools\avr -built-in-libraries C:\Program Files\Arduino\libraries -libraries D:\Mes documents\Arduino\libraries -fqbn=arduino:avr:nano:cpu=atmega328 -ide-version=10805 -build-path C:\Users\Jordan\AppData\Local\Temp\arduino_build_103940 -warnings=all -build-cache C:\Users\Jordan\AppData\Local\Temp\arduino_cache_723918 -prefs=build.warn_data_percentage=75 -prefs=runtime.tools.arduinoOTA.path=C:\Program Files\Arduino\hardware\tools\avr -prefs=runtime.tools.avr-gcc.path=C:\Program Files\Arduino\hardware\tools\avr -prefs=runtime.tools.avrdude.path=C:\Program Files\Arduino\hardware\tools\avr -verbose D:\Mes documents\Arduino\sketch_jul29a\sketch_jul29a.ino
C:\Program Files\Arduino\arduino-builder -compile -logger=machine -hardware C:\Program Files\Arduino\hardware -tools C:\Program Files\Arduino\tools-builder -tools C:\Program Files\Arduino\hardware\tools\avr -built-in-libraries C:\Program Files\Arduino\libraries -libraries D:\Mes documents\Arduino\libraries -fqbn=arduino:avr:nano:cpu=atmega328 -ide-version=10805 -build-path C:\Users\Jordan\AppData\Local\Temp\arduino_build_103940 -warnings=all -build-cache C:\Users\Jordan\AppData\Local\Temp\arduino_cache_723918 -prefs=build.warn_data_percentage=75 -prefs=runtime.tools.arduinoOTA.path=C:\Program Files\Arduino\hardware\tools\avr -prefs=runtime.tools.avr-gcc.path=C:\Program Files\Arduino\hardware\tools\avr -prefs=runtime.tools.avrdude.path=C:\Program Files\Arduino\hardware\tools\avr -verbose D:\Mes documents\Arduino\sketch_jul29a\sketch_jul29a.ino
Using board 'nano' from platform in folder: C:\Program Files\Arduino\hardware\arduino\avr
Using core 'arduino' from platform in folder: C:\Program Files\Arduino\hardware\arduino\avr
Detecting libraries used...
"C:\Program Files\Arduino\hardware\tools\avr/bin/avr-g++" -c -g -Os -w -std=gnu++11 -fpermissive -fno-exceptions -ffunction-sections -fdata-sections -fno-threadsafe-statics  -flto -w -x c++ -E -CC -mmcu=atmega328p -DF_CPU=16000000L -DARDUINO=10805 -DARDUINO_AVR_NANO -DARDUINO_ARCH_AVR   "-IC:\Program Files\Arduino\hardware\arduino\avr\cores\arduino" "-IC:\Program Files\Arduino\hardware\arduino\avr\variants\eightanaloginputs" "C:\Users\Jordan\AppData\Local\Temp\arduino_build_103940\sketch\sketch_jul29a.ino.cpp" -o "nul"
"C:\Program Files\Arduino\hardware\tools\avr/bin/avr-g++" -c -g -Os -w -std=gnu++11 -fpermissive -fno-exceptions -ffunction-sections -fdata-sections -fno-threadsafe-statics  -flto -w -x c++ -E -CC -mmcu=atmega328p -DF_CPU=16000000L -DARDUINO=10805 -DARDUINO_AVR_NANO -DARDUINO_ARCH_AVR   "-IC:\Program Files\Arduino\hardware\arduino\avr\cores\arduino" "-IC:\Program Files\Arduino\hardware\arduino\avr\variants\eightanaloginputs" "-IC:\Program Files\Arduino\hardware\arduino\avr\libraries\Wire\src" "C:\Users\Jordan\AppData\Local\Temp\arduino_build_103940\sketch\sketch_jul29a.ino.cpp" -o "nul"
"C:\Program Files\Arduino\hardware\tools\avr/bin/avr-g++" -c -g -Os -w -std=gnu++11 -fpermissive -fno-exceptions -ffunction-sections -fdata-sections -fno-threadsafe-statics  -flto -w -x c++ -E -CC -mmcu=atmega328p -DF_CPU=16000000L -DARDUINO=10805 -DARDUINO_AVR_NANO -DARDUINO_ARCH_AVR   "-IC:\Program Files\Arduino\hardware\arduino\avr\cores\arduino" "-IC:\Program Files\Arduino\hardware\arduino\avr\variants\eightanaloginputs" "-IC:\Program Files\Arduino\hardware\arduino\avr\libraries\Wire\src" "-ID:\Mes documents\Arduino\libraries\Adafruit-PWM-Servo-Driver-Library-master" "C:\Users\Jordan\AppData\Local\Temp\arduino_build_103940\sketch\sketch_jul29a.ino.cpp" -o "nul"
"C:\Program Files\Arduino\hardware\tools\avr/bin/avr-g++" -c -g -Os -w -std=gnu++11 -fpermissive -fno-exceptions -ffunction-sections -fdata-sections -fno-threadsafe-statics  -flto -w -x c++ -E -CC -mmcu=atmega328p -DF_CPU=16000000L -DARDUINO=10805 -DARDUINO_AVR_NANO -DARDUINO_ARCH_AVR   "-IC:\Program Files\Arduino\hardware\arduino\avr\cores\arduino" "-IC:\Program Files\Arduino\hardware\arduino\avr\variants\eightanaloginputs" "-IC:\Program Files\Arduino\hardware\arduino\avr\libraries\Wire\src" "-ID:\Mes documents\Arduino\libraries\Adafruit-PWM-Servo-Driver-Library-master" "C:\Users\Jordan\AppData\Local\Temp\arduino_build_103940\sketch\sketch_jul29a.ino.cpp" -o "C:\Users\Jordan\AppData\Local\Temp\arduino_build_103940\preproc\ctags_target_for_gcc_minus_e.cpp"
D:\Mes documents\Arduino\sketch_jul29a\sketch_jul29a.ino:4:20: fatal error: config.h: No such file or directory
 
 #include "config.h"
 
                    ^
 
compilation terminated.
 
Utilisation de la bibliothèque Wire version 1.0 dans le dossier: C:\Program Files\Arduino\hardware\arduino\avr\libraries\Wire 
Utilisation de la bibliothèque Adafruit-PWM-Servo-Driver-Library-master version 1.0.2 dans le dossier: D:\Mes documents\Arduino\libraries\Adafruit-PWM-Servo-Driver-Library-master 
exit status 1
Erreur de compilation pour la carte Arduino Nano
 
 
 
de plus voici dans mon éditeur les informations que le vérificateur met en orange.
 
effectivement quand j'ai chargé la bibliothèque adafruit, elle ne s'est plus affichée en orange dans le code...
 
encore merci pour vos explications et votre soutien... bonne journée à tous 
 
PS: mon fils rentre de vacances dans 1 semaine je vous promets une video de lui qui voit bouger son robot pour la première fois...
 
 
 
 
 

Image(s) jointe(s)

  • Capture 2.0.PNG
  • Capture 2.1.PNG
  • Capture 2.2.PNG
  • Capture 2.3.PNG
  • Capture 2.4.PNG


#115 Mike118

Mike118

    Staff Robot Maker

  • Administrateur
  • PipPipPipPipPip
  • 7 105 messages
  • Gender:Male
  • Location:Cholet
  • Interests:Robotique, Entrepreneuriat, Innovation, Programmation, Résolution de problème, Recherche de solutions, Mécanique, Electronique, Créer, Concevoir

Posté 08 août 2018 - 09:08

Pour partager du code mieux vaut utiliser la balise code ou bien l'éditeur en ligne arduino comme expliqué dans le tutoriel pour le partage du contenu ... C'est plus lisible ... 

 

Sinon visiblement d'après le message d'erreur il te manque le fichier config.h . 
D'où est ce que tu sors cette ligne ?  " #include " config.h"   ?


Si mon commentaire vous a plus laissez nous un avis  !  :thank_you:

Nouveau sur Robot Maker ? 

Jetez un oeil aux blogs, aux tutoriels, aux ouvrages, au robotscope  aux articles,  à la boutique  et aux différents services disponible !

 

Les réalisations de Mike118  

 

 

 


#116 Nulentout

Nulentout

    Nouveau membre

  • Membres
  • 70 messages
  • Gender:Male

Posté 08 août 2018 - 04:25

Bonjour les copains,

Voilà plusieurs jours que j’étais sans Internet ce qui explique que je ne suis pas venu pour tenter d’aider JORDAN.

 

Le listage ne correspond pas en nom à l’un de mes programmes, du coup je ne sais pas lequel je dois charger dans l’IDE pour chercher à voir ce qui bloque.

 

Amicalement : Nulentout.






1 utilisateur(s) li(sen)t ce sujet

0 members, 1 guests, 0 anonymous users